{"text_format":"1","workbook":"xlsx","n_sheets":5,"sheets":["Amendment Form","Guidance Notes","ICB","HWB","Revision History"],"not_rendered":{"charts":0,"images":1,"macros":0,"external_links":0,"defined_names":6,"comments":0,"pivot_tables":0},"unopened":[],"bounds":{"document_bytes":16777216,"sheet_cells":100000,"rows_first":2000,"rows_last":500,"rows_between":2000,"halvings":0,"cell_chars":16384,"cell_head_chars":4096},"cells_cut":0,"cells_raw":0,"read":"whole","date_system":"1900"}

{"sheet":"Amendment Form","index":0,"n_rows":125,"n_cols":12,"rows_kept":125,"cut":false,"hidden":false,"merged":[[72,2,73,2],[72,3,73,3],[72,4,73,4],[72,5,73,5],[72,6,73,6],[72,7,73,7],[66,7,67,7],[68,1,69,1],[68,2,69,2],[68,3,69,3],[68,4,69,4],[68,5,69,5],[68,6,69,6],[68,7,69,7],[70,2,71,2],[70,3,71,3],[70,4,71,4],[70,5,71,5],[70,6,71,6],[66,1,67,1],[66,2,67,2],[66,3,67,3],[66,4,67,4],[66,5,67,5],[64,1,65,1],[64,2,65,2],[64,3,65,3],[64,4,65,4],[64,5,65,5],[64,6,65,6],[64,7,65,7],[60,1,61,1],[60,2,61,2],[60,3,61,3],[60,4,61,4],[60,5,61,5],[60,6,61,6],[60,7,61,7],[62,1,63,1],[62,2,63,2],[62,3,63,3],[62,4,63,4],[62,5,63,5],[62,6,63,6],[41,2,41,4],[41,5,41,7],[44,2,45,4],[32,2,33,7],[34,2,34,4],[35,2,36,7],[44,5,45,7],[56,7,57,7],[62,7,63,7],[42,2,42,4],[42,5,42,7],[10,1,10,7],[11,1,11,7],[16,1,16,7],[13,2,13,4],[13,6,13,7],[14,1,14,7],[15,2,15,4],[15,6,15,7],[50,2,51,4],[50,5,51,7],[17,1,17,7],[19,1,19,2],[20,1,20,2],[12,1,12,7],[22,1,22,2],[23,1,23,2],[21,1,21,2],[46,2,47,4],[46,5,47,7],[48,2,49,4],[48,5,49,7],[32,1,33,1],[37,1,38,1],[39,1,40,1],[44,0,45,0],[85,1,86,1],[35,1,36,1],[52,1,53,1],[46,1,47,1],[79,1,80,1],[56,1,57,1],[81,1,82,1],[83,1,84,1],[54,1,55,1],[48,1,49,1],[50,1,51,1],[44,1,45,1],[70,1,71,1],[58,1,58,7],[74,1,75,1],[74,2,75,2],[74,3,75,3],[74,4,75,4],[74,5,75,5],[74,6,75,6],[74,7,75,7],[70,7,71,7],[72,1,73,1],[88,1,89,7],[90,1,91,1],[90,2,91,3],[90,4,91,5],[90,6,91,7],[79,2,80,7],[85,2,86,7],[87,1,87,7],[81,2,82,7],[83,2,84,7],[24,1,24,2],[26,1,26,2],[28,1,29,7],[31,1,31,7],[27,1,27,2],[19,4,27,7],[76,1,77,1],[76,2,77,3],[76,4,77,5],[76,6,77,7],[56,2,57,3],[56,4,57,4],[56,5,57,6],[52,2,53,4],[52,5,53,7],[54,2,55,4],[54,5,55,7],[66,6,67,6],[37,2,38,4],[37,5,38,7],[39,2,40,4],[39,5,40,7],[34,5,34,7],[43,1,43,7]]}
[]
[]
[]
[]
[]
[]
[]
[]
[]
[]
[null,"Change of NHS Appliance Contractor Details "]
[null,"Authorised signatory should complete form and send to: prescriptioninformation@nhsbsa.nhs.uk"]
[]
[null,"ICB Name","Please select ICB",null,null,"ICB Code (automatically populated)",{"$f":"VLOOKUP(C14,ICB!A1:B43,2,FALSE)","v":"N/A"}]
[]
[null,"Health and Wellbeing Board Area","Please select HWB",null,null,"HWB Code (automatically populated)",{"$f":"VLOOKUP(C16,HWB!A1:B162,2,FALSE)","v":"N/A"}]
[]
[null,"Please tick applicable box(es)"]
[]
[null,"Change of Contractor/Owner name (e.g. to a Limited Company)"]
[null,"Change of Contractor trading name"]
[null,"Change of owner/head office email address"]
[null,"Change of Address"]
[null,"Change of telephone number"]
[null,"Change of STP",null,null,null,null,null,null,null,null,null,"`"]
[null,"Change of Opening Hours"]
[null,"Change of EPS status"]
[null,"Other (please specify below)"]
[]
[]
[]
[null,"Please note: NHS Prescription Services will not allocate a new contractor code as a result of this change."]
[null,"Contractor Code"]
[]
[null,null,"Existing Details",null,null,"New Details"]
[null,"Date of change"]
[]
[null,"Contractor/Owner name (max. 40 characters including spaces)"]
[]
[null,"Contractor Trading Name (max. 40 characters including spaces)"]
[]
[null,"Email address of owner/head office"]
[null,"NHS Shared Email Address"]
[null,"Address details (max. 25 characters per line including spaces)"]
[null,"Address line 1"]
[]
[null,"Address line 2"]
[]
[null,"Address line 3 (town or city only)"]
[]
[null,"Address line 4 (county or London only)"]
[]
[null,"Postcode"]
[]
[null,"Telephone number"]
[]
[null,"ICB Name (ICB Code will be automatically populated)",null,null,{"$f":"IFERROR(VLOOKUP(C57,ICB!A2:B43,2), \"\")","v":""},null,null,{"$f":"IFERROR(VLOOKUP(F57,ICB!A2:B43,2), \"\")","v":""}]
[]
[null,"Opening Hours ( up to three sets of opening times using 24 hour clock)"]
[null,null,"Opening Time","Closing Time","Opening Time","Closing Time","Opening Time","Closing Time"]
[null,"Example","06:00:00","12:00:00","12:30:00","17:00:00","18:00:00","23:00:00"]
[]
[null,"Monday"]
[]
[null,"Tuesday"]
[]
[null,"Wednesday"]
[]
[null,"Thursday"]
[]
[null,"Friday"]
[]
[null,"Saturday"]
[]
[null,"Sunday"]
[]
[null,"EPS R2 Active System?",null,null,"EPS R2 Go Live Date?\n(if different to date of change)"]
[]
[]
[null,"Authorised signatory:"]
[]
[null,"Print name:"]
[]
[null,"Contact Number:"]
[]
[null,"Date:"]
[]
[]
[null,"For NHS Prescription Services use only"]
[]
[null,"MDR input (Date & Initials)",null,null,"Date sent to Wakefield division/CPS"]
[]
[null,null,null,null,null,null,null,"v2.9 April 2024"]
[]
[]
[]
[]
[]
[]
[]
[]
[]
[]
[]
[null,null,null,null,null,"Walk-in Centre"]
[null,null,null,null,null,"Out-of-Hours Service"]
[null,null,null,null,null,"Walk-in Centre and Out-of-Hours Service"]
[null,null,null,null,null,"Public Health Service"]
[null,null,null,null,null,"Community Health Service"]
[null,null,null,null,null,"Hospital Service"]
[null,null,null,null,null,"Optometry Service"]
[null,null,null,null,null,"Urgent and Emergency Care"]
[null,null,null,null,null,"Hospice"]
[null,null,null,null,null,"Care Home/Nursing Home"]
[null,null,null,null,null,"Other"]
[]
[null,false,null,null,"Yes","Yes (Please provide VAT Number below)",null,"Yes (please provide details below)"]
[null,false,null,null,"No","No",null,"No"]
[null,false]
[null,false]
[null,false]
[null,false]
[null,false]
[null,false]
[null,false]

{"sheet":"Guidance Notes","index":1,"n_rows":23,"n_cols":2,"rows_kept":23,"cut":false,"hidden":false,"merged":[]}
[]
["ICB Name","The name of the Integrated Care Board that the NHS Pharmacy Contractor is to be attached to (choose from drop down box)"]
["ICB Code","The code of the ICB. (***) - automatically generated"]
["Health and Wellbeing Board Area","The name of the Health and Wellbeing Board Area the NHS Pharmacy Contractor is in (choose from drop down box)"]
["HWB Code","The code of the HWB - automatically generated"]
["Reason For Change","Please tick applicable box"]
[null,"Please note: NHS Prescription Services will not allocate a new contractor code as a result of this change."]
["Contractor Code","The contractor code (F****)"]
["Date of Change","The date of the changes of the NHS Appliance contractor"]
["Contractor/Owner name"," The name of the Contractor/Owner (max. 40 characters including spaces)"]
["Contractor Trading Name","The Contractor trading name (max. 40 characters including spaces)"]
["Email address of owner/head office","The email address of the owner/head office"]
["Address","The address must adhere to the following format.  Each line has 25 characters including spaces"]
[null,"1st Line - address details"]
[null,"2nd Line - address details"]
[null,"3rd Line - Town/City only"]
[null,"4th Line - County/London only"]
["Telephone Number","Please state telephone number of NHS Appliance Contractor"]
["ICB Change","Choose from drop down box"]
["Opening Hours","Opening Hours for the contractor in 24 hour clock format - a maximum of three sets of data per day."]
["EPS R2 Active System?","Is there an active EPS system for the contract (choose from drop down box)"]
["EPS R2 Go Live Date","Date system goes live if different to that of start of contract"]
["Authorised Signatory","This is the authorised signatory at the ICB (or an agency on their behalf) "]

{"sheet":"ICB","index":2,"n_rows":43,"n_cols":2,"rows_kept":43,"cut":false,"hidden":true,"merged":[]}
["Please select ICB","N/A"]
["Bath and North East Somerset, Swindon and Wiltshire ICB","QOX"]
["Bedfordshire, Luton and Milton Keynes ICB","QHG"]
["Birmingham and Solihull ICB","QHL"]
["Black Country ICB","QUA"]
["Bristol, North Somerset and South Gloucestershire ICB","QUY"]
["Buckinghamshire, Oxfordshire and Berkshire West ICB","QU9"]
["Cambridgeshire and Peterborough ICB","QUE"]
["Cheshire and Merseyside ICB","QYG"]
["Cornwall and the Isles of Scilly ICB","QT6"]
["Coventry and Warwickshire ICB","QWU"]
["North East And North Cumbria ICB","QHM"]
["Devon ICB","QJK"]
["Dorset ICB","QVV"]
["North East London ICB","QMF"]
["Frimley ICB","QNQ"]
["Gloucestershire ICB","QR1"]
["Greater Manchester ICB","QOP"]
["Hampshire and the Isle of Wight ICB","QRL"]
["Lancashire and South Cumbria ICB","QE1"]
["Herefordshire and Worcestershire ICB","QGH"]
["Hertfordshire and West Essex ICB","QM7"]
["Humber and North Yorkshire ICB","QOQ"]
["Derby And Derbyshire ICB","QJ2"]
["Kent and Medway ICB","QKS"]
["Leicester, Leicestershire and Rutland ICB","QK1"]
["Lincolnshire ICB","QJM"]
["Mid and South Essex ICB","QH8"]
["Norfolk and Waveney ICB","QMM"]
["North Central London ICB","QMJ"]
["North West London ICB","QRV"]
["Northamptonshire ICB","QPM"]
["Nottingham and Nottinghamshire ICB","QT1"]
["South East London ICB","QKK"]
["Shropshire, Telford and Wrekin ICB","QOC"]
["Somerset ICB","QSL"]
["South West London ICB","QWE"]
["South Yorkshire ICB","QF7"]
["Staffordshire and Stoke-on-Trent ICB","QNC"]
["Suffolk and North East Essex ICB","QJG"]
["Surrey Heartlands ICB","QXU"]
["Sussex ICB","QNX"]
["West Yorkshire ICB","QWO"]

{"sheet":"HWB","index":3,"n_rows":162,"n_cols":2,"rows_kept":162,"cut":false,"hidden":true,"merged":[]}
["Please select HWB","N/A"]
["Ashford","HW162"]
["Barking and Dagenham ","HW001"]
["Barnet ","HW002"]
["Barnsley ","HW003"]
["Bassetlaw ","HW004"]
["Bath and North East Somerset ","HW005"]
["Bedford Borough","HW006"]
["Bexley ","HW007"]
["Birmingham ","HW008"]
["Blackburn with Darwen ","HW009"]
["Blackpool ","HW010"]
["Bolton","HW011"]
["Bournemouth and Poole ","HW013"]
["Bracknell and Ascot ","HW014"]
["Bradford and Airedale ","HW015"]
["Brent ","HW016"]
["Brighton and Hove ","HW017"]
["Bristol ","HW018"]
["Bromley ","HW020"]
["Buckinghamshire ","HW021"]
["Bury ","HW022"]
["Calderdale ","HW023"]
["Cambridgeshire ","HW024"]
["Camden ","HW025"]
["Canterbury and Coastal","HW163"]
["Central Bedfordshire","HW026"]
["Cheshire East ","HW027"]
["Cheshire West and Chester ","HW028"]
["City of London ","HW029"]
["Cornwall ","HW030"]
["Coventry ","HW031"]
["Croydon ","HW032"]
["Cumberland","HW168"]
["Cumbria ","HW033"]
["Darlington ","HW035"]
["Derby City ","HW036"]
["Derbyshire ","HW037"]
["Devon ","HW038"]
["Doncaster ","HW039"]
["Dorset ","HW040"]
["Dudley ","HW041"]
["Durham ","HW042"]
["Ealing ","HW043"]
["East Riding Of Yorkshire ","HW044"]
["East Sussex ","HW045"]
["Enfield ","HW046"]
["Essex ","HW047"]
["Gateshead ","HW048"]
["Gloucestershire ","HW049"]
["Greenwich ","HW050"]
["Hackney ","HW051"]
["Halton ","HW052"]
["Hammersmith and Fulham ","HW053"]
["Hampshire ","HW054"]
["Haringey ","HW055"]
["Harrow ","HW056"]
["Hartlepool ","HW057"]
["Havering ","HW058"]
["Herefordshire ","HW059"]
["Hertfordshire ","HW060"]
["Hillingdon ","HW061"]
["Hounslow ","HW062"]
["Hull ","HW063"]
["Isle Of Wight ","HW066"]
["Isles of Scilly ","HW067"]
["Islington ","HW068"]
["Kensington & Chelsea ","HW069"]
["Kent ","HW070"]
["Kingston ","HW071"]
["Kirklees ","HW072"]
["Knowsley ","HW073"]
["Lambeth ","HW074"]
["Lancashire ","HW075"]
["Leeds ","HW076"]
["Leicester City ","HW077"]
["Leicestershire ","HW078"]
["Lewisham ","HW079"]
["Lincolnshire ","HW080"]
["Liverpool ","HW081"]
["Luton ","HW082"]
["Manchester ","HW084"]
["Medway ","HW085"]
["Merton ","HW086"]
["Middlesbrough ","HW087"]
["Milton Keynes ","HW088"]
["Newcastle ","HW089"]
["Newham ","HW090"]
["Norfolk ","HW091"]
["North East Lincolnshire ","HW092"]
["North Lincolnshire ","HW093"]
["North Somerset ","HW094"]
["North Tyneside ","HW095"]
["North Yorkshire ","HW096"]
["Northamptonshire ","HW097"]
["Northamptonshire North","HW169"]
["Northumberland ","HW098"]
["Nottingham City ","HW099"]
["Nottinghamshire ","HW100"]
["Oldham ","HW102"]
["Oxfordshire ","HW103"]
["Peterborough ","HW104"]
["Plymouth ","HW105"]
["Portsmouth ","HW106"]
["Reading ","HW107"]
["Redbridge ","HW108"]
["Redcar & Cleveland ","HW109"]
["Richmond ","HW110"]
["Rochdale ","HW111"]
["Rotherham ","HW112"]
["Rutland ","HW113"]
["Salford ","HW115"]
["Sandwell ","HW116"]
["Sefton ","HW117"]
["Sheffield ","HW118"]
["Shropshire ","HW119"]
["Slough ","HW120"]
["Solihull ","HW121"]
["Somerset ","HW122"]
["South Gloucestershire ","HW123"]
["South Kent Coast","HW164"]
["South Tyneside ","HW124"]
["Southampton ","HW125"]
["Southend on Sea ","HW126"]
["Southwark ","HW127"]
["St Albans ","HW128"]
["St Helens ","HW129"]
["Staffordshire ","HW130"]
["Stockport ","HW131"]
["Stockton-on-Tees ","HW132"]
["Stoke-On-Trent ","HW133"]
["Suffolk ","HW134"]
["Sunderland ","HW135"]
["Surrey ","HW136"]
["Sutton ","HW137"]
["Swale","HW165"]
["Swindon ","HW138"]
["Tameside ","HW139"]
["Telford & Wrekin ","HW140"]
["Thanet","HW166"]
["Thurrock ","HW141"]
["Torbay ","HW142"]
["Tower Hamlets ","HW143"]
["Trafford ","HW144"]
["Wakefield ","HW145"]
["Walsall ","HW146"]
["Waltham Forest ","HW147"]
["Wandsworth ","HW148"]
["Warrington ","HW149"]
["Warwickshire ","HW150"]
["West Berkshire ","HW151"]
["West Sussex ","HW152"]
["Westminster ","HW153"]
["Westmorland and Furness","HW167"]
["Wigan ","HW154"]
["Wiltshire ","HW155"]
["Windsor and Maidenhead ","HW156"]
["Wirral ","HW157"]
["Wokingham ","HW158"]
["Wolverhampton ","HW159"]
["Worcestershire ","HW160"]
["York ","HW161"]

{"sheet":"Revision History","index":4,"n_rows":13,"n_cols":4,"rows_kept":13,"cut":false,"hidden":true,"merged":[]}
["Version","Date","Reason for change","Editor"]
[2,"2022-05-01","New document created from old Excel forms","LAMAT"]
[2.1,"2022-06-29","Changed dropdown to ICB, added opening hours","ALGRA"]
[2.2000000000000002,"2022-06-30","Fixed conditional formatting issues. Changed remained references to STPs and added revision history. Removed 'for prescription services only' at bottom","LAMAT"]
[2.2999999999999998,"2023-05-04","added migration note - new email","ANSCU"]
[2.4,"2023-05-04","added migration note - new email","ANSCU"]
[2.6,"2023-06-27","updated email info on form header","MICBU"]
[2.6,"2023-06-27","updated HWB list to include Westmorland and Furness (HW167) and Cumberland (HW168)","MICBU"]
[2.6,"2023-06-27","updated ICB names of QUA, QNC, QOC, QOQ, QT6","MICBU"]
[2.7,"2023-08-31","edit Objects' ticked on sheet security for image insertions","MICBU"]
[2.8,"2024-01-29","Bedford Borough HWB name updated from Bedford","MICBU"]
[2.9,"2024-04-02","added Northamptonshire North to HWB list","MICBU"]
[2.9,"2024-04-02","added NHS Shared Email address section","MICBU"]