{"text_format":"1","workbook":"xlsx","n_sheets":11,"sheets":["Input","CER 1995 NRA 55","CER 1995","CER 2008","CER 2008 OPTANT","CER 2015","VER Factors 01-09-2023","CER Factors 01-11-2023","VER Factors (pre 01-09-2023)","CER Factors (pre 1-11-23)","VER Factors (pre 30-06-2023)"],"not_rendered":{"charts":0,"images":0,"macros":1,"external_links":0,"defined_names":6,"comments":0,"pivot_tables":0},"unopened":[],"bounds":{"document_bytes":16777216,"sheet_cells":100000,"rows_first":2000,"rows_last":500,"rows_between":2000,"halvings":0,"cell_chars":16384,"cell_head_chars":4096},"cells_cut":0,"cells_raw":0,"read":"whole","date_system":"1900"}

{"sheet":"Input","index":0,"n_rows":50,"n_cols":15,"rows_kept":50,"cut":false,"hidden":false,"merged":[[6,14,6,20],[1,14,1,20],[1,9,1,13],[5,14,5,20],[2,14,2,20],[3,14,3,20],[4,14,4,20],[13,5,13,6],[15,5,15,6],[27,2,27,6],[2,9,2,13],[3,9,3,13],[4,9,4,13],[5,9,5,13],[6,9,6,13]]}
[]
[null,null,null,null,null,null,null,null,0,"Field",null,null,null,null,"Description from TRS Statement"]
[null,null,null,null,null,null,null,null,1,"TRS/ABS Date",null,null,null,null,"Updated To"]
[null,null,"Early Retirement Calculation","Input On All Orange Fields ",1995,null,null,null,2,"TRS/ABS Pension",null,null,null,null,"Pension from 'Current value of Benefits'"]
[null,null,null,null,2008,null,null,null,3,"TRS/ABS  Lump Sum",null,null,null,null,"Lump Sum from 'Current value of Benefits'"]
[null,null,null,null,"2008 Optant","Yes",null,null,4,"TRS/ABS Survivor Pension",null,null,null,null,"Adult Dependant Pension from 'Current value of Benefits'"]
[null,null,"Are you an Active Member",null,2015,"No",null,null,5,"Manadatory Lump Sum 2008 Optants Only",null,null,null,null,"Lump Sum from 'Current value of Benefits'"]
[null,null,"Section/Scheme",null,null,65,null,null,6]
[null,null,{"$f":"IF(D8=\"\",\"\",IF(D8<>2015,\"Do you have membership in 2015 Scheme?\",\"\"))","v":""}]
[null,null,"Date of Birth",null,null,66,null,null,7]
[null,null,"Retirement Date (Payable Date)",null,null,67,null,null,8]
[null,null,"TRS/ABS Date",null,null,68,null,null,9]
[null,null,"Total Membership at TRS/ABS Date (Reckonable Service) ",null,"Years",{"$f":"(D13*365)+D14","v":0},"Days",null,10]
[null,null,"Total Membership at TRS/ABS Date (Reckonable Service) ",null,"Days","Total Reck Service",null,null,11]
[null,null,"Calendar Service at TRS/ABS Date",null,"Years",{"$f":"(D15*365)+D16","v":0},"Days"]
{"$rows_left_out":36}
{"sheet":"CER 1995 NRA 55","index":1,"n_rows":47,"n_cols":12,"rows_kept":47,"cut":false,"hidden":true,"merged":[]}
[]
[null,"Compulsory Early Retirement of a 1995 section member NRA55"]
[]
[null,"Members Name:-",null,null,null,null,null,"SD Number:-"]
[]
[null,"Section: 1995",null,null,null,null,null,"NPA: 55"]
[null,"Date of Birth:",null,null,null,null,null,"Date of Redundancy:   "]
[null,"Age at redundancy:      ","Years      ","Months"]
[null,"Years leaving before NPA:      ","Years    ","Month","(Period from retirement to NPA rounded up)"]
[]
[null,"ERF1 Factor:-",null,null,null,null,null,"CER1 Factor:-"]
[null,"ERF7 Factor:-",null,null,null,null,null,"CER3 Factor:-"]
[null,"ERF12 Factor:-",null,null,null,null,null,"(Based on years and months leaving early)"]
[null,"Unreduced Pension = £",null,null,null,"(A)  Reduced Pension = £",null,null,"(B)"]
[null,"Unreduced Lump sum = £",null,null,null,"(C)  Reduced Lump Sum = £",null,null,"(D)"]
{"$rows_left_out":33}
{"sheet":"CER 1995","index":2,"n_rows":32,"n_cols":10,"rows_kept":32,"cut":false,"hidden":true,"merged":[[22,1,22,4],[22,5,22,6],[17,9,17,10],[20,5,20,6],[21,5,21,6],[21,1,21,4],[31,9,31,10],[66,4,66,5],[66,8,66,9],[72,4,72,5],[72,8,72,9],[52,6,52,7],[52,4,52,5],[52,9,52,10],[35,4,35,5],[48,9,48,10],[76,4,76,5],[68,4,68,5],[68,8,68,9],[58,4,58,5],[58,6,58,7],[58,8,58,9],[62,4,62,5],[62,6,62,7],[62,8,62,9],[52,11,52,12],[54,4,54,5],[54,6,54,7],[54,9,54,10],[54,11,54,12],[13,9,13,10],[14,3,14,4],[14,9,14,10],[13,3,13,4],[3,9,3,11],[7,9,7,10],[3,3,3,6],[7,3,7,4],[11,7,11,9],[9,9,9,10],[25,3,25,4],[30,3,30,4],[24,9,24,10],[25,9,25,10],[26,3,26,4],[28,3,28,4],[26,9,26,10],[28,9,28,10],[29,9,29,10],[29,3,29,4],[27,3,27,4],[27,9,27,10],[24,3,24,4],[35,11,35,12],[35,6,35,7],[37,4,37,5],[37,9,37,10],[35,9,35,10],[48,11,48,12],[48,6,48,7],[48,4,48,5],[37,11,37,12],[46,4,46,5],[46,6,46,7],[46,9,46,10],[46,11,46,12]]}
[null,"1995 Section - Early Retirement Calculation"]
[]
[]
[null,"Members Name:-",null,{"$f":"Input!#REF!","v":{"$error":"#REF!"}},null,null,null,null,"SD Number:-",{"$f":"Input!D7","v":0}]
[]
[null,"Section:",null,1995,null,null,null,null,"Pension Age:",60]
[]
[null,"Date of Birth:",null,{"$f":"Input!D10","v":"00:00:00"},null,null,null,null,"NPA Date:",{"$f":"DATE(YEAR(D8)+J6,MONTH(D8),DAY(D8)-1)","v":"1959-12-30"}]
[]
[null,"Age at Payment Date:      ",null,"Years      ",{"$f":"DATEDIF(D8,J10,\"Y\")","v":0},"Months",{"$f":"DATEDIF(D8,J10,\"M\")-(E10*12)","v":0},null,"Payment date:   ",{"$f":"Input!D11","v":"00:00:00"}]
[]
[null,"Years leaving before NPA:      ",null,"Years    ",{"$f":"INT(((J6*12)-((E10*12)+G10))/12)","v":60},"Months",{"$f":"J6*12-((E10*12)+G10)-(E12*12)","v":0},"(Period from DoR to SPA)"]
[]
[null,"ERF1 Factor:",null,{"$f":"IF(J10<DATE(2023,6,30),VLOOKUP(E10,'VER Factors (pre 30-06-2023)'!C8:O17,G10+2,FALSE),IF(J10>=DATE(2023,6,30),VLOOKUP(E10,'VER Factors 01-09-2023'!C8:O17,G10+2,FALSE)))","v":{"$error":"#N/A"}},null,null,null,null,"Date for 1995 Optional","2008-04-01"]
[null,"ERF7 Factor:",null,{"$f":"IF(J10<DATE(2023,6,30),VLOOKUP(E10,'VER Factors (pre 30-06-2023)'!C28:O37,G10+2,FALSE),IF(J10>=DATE(2023,6,30),VLOOKUP(E10,'VER Factors 01-09-2023'!C28:O37,G10+2,FALSE)))","v":{"$error":"#N/A"}}]
{"$rows_left_out":18}
{"sheet":"CER 2008","index":3,"n_rows":32,"n_cols":10,"rows_kept":32,"cut":false,"hidden":true,"merged":[[67,4,67,5],[72,4,72,5],[27,3,27,4],[28,3,28,4],[27,9,27,10],[28,9,28,10],[57,4,57,5],[57,6,57,7],[51,4,51,5],[51,6,51,7],[51,9,51,10],[31,3,31,4],[29,9,29,10],[29,3,29,4],[31,9,31,10],[51,11,51,12],[37,11,37,12],[49,4,49,5],[49,6,49,7],[49,9,49,10],[49,11,49,12],[37,4,37,5],[37,6,37,7],[37,9,37,10],[5,3,5,6],[5,9,5,11],[9,3,9,4],[9,9,9,10],[11,3,11,4],[11,9,11,10],[24,5,24,6],[17,3,17,4],[17,9,17,10],[26,3,26,4],[26,9,26,10],[18,3,18,4],[20,9,20,10],[23,5,23,6],[24,1,24,4]]}
[]
[]
[null,"2008 Compulsory Early Retirement Calculation"]
[]
[]
[null,"Members Name:-",null,{"$f":"Input!#REF!","v":{"$error":"#REF!"}},null,null,null,null,"SD Number:-",{"$f":"Input!D7","v":0}]
[]
[null,"Section:",null,2008,null,null,null,null,"Pension Age:",65]
[]
[null,"DOB / AGE",null,{"$f":"Input!D10","v":"00:00:00"},null,null,null,null,"NPA Date:",{"$f":"DATE(YEAR(D12)+J8,MONTH(D12),DAY(D12))","v":"1964-12-31"}]
[]
[null,"Date of Birth:",null,{"$f":"Input!D10","v":"00:00:00"},null,null,null,null,"Payment date:",{"$f":"Input!D11","v":"00:00:00"}]
[]
[null,"Age at Payment Date:      ",null,"Years      ",{"$f":"DATEDIF(D12,J12,\"Y\")","v":0},"Months",{"$f":"DATEDIF(D12,J12,\"M\")-(E14*12)","v":0}]
[]
{"$rows_left_out":18}
{"sheet":"CER 2008 OPTANT","index":4,"n_rows":36,"n_cols":12,"rows_kept":36,"cut":false,"hidden":true,"merged":[[80,8,80,9],[84,4,84,5],[58,4,58,5],[58,6,58,7],[58,9,58,10],[60,4,60,5],[60,6,60,7],[60,9,60,10],[64,8,64,9],[70,4,70,5],[70,6,70,7],[66,4,66,5],[66,8,66,9],[64,4,64,5],[64,6,64,7],[80,4,80,5],[40,11,40,12],[52,4,52,5],[52,6,52,7],[52,9,52,10],[52,11,52,12],[40,4,40,5],[40,6,40,7],[40,9,40,10],[42,9,42,10],[42,11,42,12],[42,6,42,7],[54,9,54,10],[54,11,54,12],[42,4,42,5],[76,4,76,5],[76,8,76,9],[70,8,70,9],[74,4,74,5],[74,8,74,9],[54,4,54,5],[54,6,54,7],[58,11,58,12],[60,11,60,12],[33,3,33,4],[35,9,35,10],[25,5,25,6],[32,3,32,4],[32,9,32,10],[35,3,35,4],[33,9,33,10],[31,3,31,4],[31,9,31,10],[28,3,28,4],[28,9,28,10],[30,3,30,4],[30,9,30,10],[29,3,29,4],[29,9,29,10],[26,1,26,4],[26,5,26,6],[5,3,5,6],[5,9,5,11],[9,3,9,4],[9,9,9,10],[11,3,11,4],[11,9,11,10],[17,3,17,4],[18,3,18,4],[19,3,19,4],[17,9,17,10],[18,9,18,10],[22,9,22,10]]}
[]
[]
[null,"2008 OPTANT Compulsory Early Retirement Calculation"]
[]
[]
[null,"Members Name:-",null,{"$f":"Input!#REF!","v":{"$error":"#REF!"}},null,null,null,null,"SD Number:-",{"$f":"Input!D7","v":0}]
[]
[null,"Section:",null,2008,null,null,null,null,"Pension Age:",65]
[]
[null,"DOB / AGE",null,{"$f":"Input!D10","v":"00:00:00"},null,null,null,null,"NPA Date:",{"$f":"DATE(YEAR(D12)+J8,MONTH(D12),DAY(D12))","v":"1964-12-31"}]
[]
[null,"Date of Birth:",null,{"$f":"Input!D10","v":"00:00:00"},null,null,null,null,"Payment Date",{"$f":"Input!D11","v":"00:00:00"}]
[]
[null,"Age at Payment Date:      ",null,"Years      ",{"$f":"DATEDIF(D12,J12,\"Y\")","v":0},"Months",{"$f":"DATEDIF(D12,J12,\"M\")-(E14*12)","v":0}]
[]
{"$rows_left_out":22}
{"sheet":"CER 2015","index":5,"n_rows":34,"n_cols":13,"rows_kept":34,"cut":false,"hidden":true,"merged":[[54,4,54,5],[54,6,54,7],[54,9,54,10],[52,4,52,5],[52,6,52,7],[52,9,52,10],[73,5,73,6],[73,3,73,4],[60,4,60,5],[60,6,60,7],[60,8,60,9],[68,4,68,5],[68,8,68,9],[52,11,52,12],[33,9,33,10],[54,11,54,12],[17,3,17,4],[17,9,17,10],[28,3,28,4],[28,9,28,10],[33,3,33,4],[39,4,39,5],[39,6,39,7],[39,9,39,10],[29,3,29,4],[29,9,29,10],[30,3,30,4],[30,9,30,10],[31,9,31,10],[39,11,39,12],[5,3,5,6],[5,9,5,11],[9,3,9,4],[9,9,9,10],[11,3,11,4],[11,9,11,10],[19,9,19,10],[22,5,22,6],[23,1,23,4],[23,5,23,6],[31,3,31,4]]}
[]
[]
[null,"2015 Compulsory Early Retirement Calculation"]
[]
[]
[null,"Members Name:-",null,{"$f":"Input!#REF!","v":{"$error":"#REF!"}},null,null,null,null,"SD Number:-",{"$f":"Input!D7","v":0}]
[]
[null,"Section:",null,2015,null,null,null,null,"Pension Age:",{"$f":"Input!D22","v":0},"Years",{"$f":"Input!D23","v":0},"Months"]
[]
[null,"DOB / AGE",null,{"$f":"Input!D10","v":"00:00:00"},null,null,null,null,"NPA Date:",{"$f":"DATE(YEAR(D12)+J8,MONTH(D12),DAY(D12))","v":"00:00:00"}]
[]
[null,"Date of Birth:",null,{"$f":"Input!D10","v":"00:00:00"},null,null,null,null,"Payment Date:",{"$f":"Input!D11","v":"00:00:00"}]
[]
[null,"Age at Payment Date:      ",null,"Years      ",{"$f":"DATEDIF(D12,J12,\"Y\")","v":0},"Months",{"$f":"DATEDIF(D12,J12,\"M\")-(E14*12)","v":0}]
[]
{"$rows_left_out":20}
{"sheet":"VER Factors 01-09-2023","index":6,"n_rows":320,"n_cols":27,"rows_kept":320,"cut":false,"hidden":true,"merged":[[23,1,23,14],[1,1,1,14],[3,1,3,14],[4,3,4,14],[5,3,5,14],[7,1,17,1],[84,2,84,14],[24,3,24,14],[25,3,25,14],[27,1,37,1],[40,1,40,14],[41,3,41,14],[42,3,42,14],[44,1,59,1],[67,2,67,14],[81,2,81,14],[82,2,82,14],[83,2,83,14],[212,2,212,14],[277,2,277,14],[89,2,89,15],[90,2,90,15],[91,2,91,15],[92,2,92,15],[94,2,94,14],[153,2,153,14]]}
["Factors in these tables are all applicable from 1st September  2023"]
[null,"NHS Pension Scheme (E&W): Early Retirement Factors"]
[]
[null,"Benefits Payable to the Member on ARER\n1995 Scheme (NPA 60)"]
[null,"Table - ERF 1",null,"Pension Factors"]
[null,null,null,"Age: Complete Months"]
[null,null,null,0,1,2,3,4,5,6,7,8,9,10,11]
[null,"Complete Years",50,0.68200000000000005,0.68400000000000005,0.68600000000000005,0.68799999999999994,0.68899999999999995,0.69099999999999995,0.69299999999999995,0.69499999999999995,0.69699999999999995,0.69899999999999995,0.7,0.70199999999999996]
[null,null,51,0.70399999999999996,0.70599999999999996,0.70799999999999996,0.71,0.71199999999999997,0.71399999999999997,0.71599999999999997,0.71799999999999997,0.72,0.72199999999999998,0.72399999999999998,0.72599999999999998]
[null,null,52,0.72799999999999998,0.73,0.73199999999999998,0.73499999999999999,0.73699999999999999,0.73899999999999999,0.74099999999999999,0.74299999999999999,0.745,0.748,0.75,0.752]
[null,null,53,0.754,0.75600000000000001,0.75900000000000001,0.76100000000000001,0.76300000000000001,0.76600000000000001,0.76800000000000002,0.77,0.77300000000000002,0.77500000000000002,0.77700000000000002,0.78]
[null,null,54,0.78200000000000003,0.78500000000000003,0.78700000000000003,0.79,0.79200000000000004,0.79500000000000004,0.79700000000000004,0.8,0.80200000000000005,0.80500000000000005,0.80700000000000005,0.81]
[null,null,55,0.81200000000000006,0.81499999999999995,0.81799999999999995,0.82,0.82299999999999995,0.82599999999999996,0.82899999999999996,0.83099999999999996,0.83399999999999996,0.83699999999999997,0.84,0.84199999999999997]
[null,null,56,0.84499999999999997,0.84799999999999998,0.85099999999999998,0.85399999999999998,0.85699999999999998,0.86,0.86299999999999999,0.86499999999999999,0.86799999999999999,0.871,0.874,0.877]
[null,null,57,0.88,0.88300000000000001,0.88600000000000001,0.88900000000000001,0.89200000000000002,0.89500000000000002,0.89900000000000002,0.90200000000000002,0.90500000000000003,0.90800000000000003,0.91100000000000003,0.91400000000000003]
{"$rows_left_out":306}
{"sheet":"CER Factors 01-11-2023","index":7,"n_rows":49,"n_cols":15,"rows_kept":49,"cut":false,"hidden":true,"merged":[[31,3,31,14],[32,3,32,14],[34,1,44,1],[48,2,48,14],[1,2,1,14],[3,1,3,14],[4,3,4,14],[5,3,5,14],[7,1,25,1],[30,1,30,14]]}
["Factors in these tables are applicable from 1st November 2023"]
[null,null,"NHS Pension Scheme (E&W): Acutarial Factors"]
[]
[null,"Cost for a Member leaving on Complusory Early Retirement\nFactors Applicable to Main Pension Scheme"]
[null,"Table - CER 1",null,"Pension Factors"]
[null,null,null,"Age: Complete Months"]
[null,null,null,0,1,2,3,4,5,6,7,8,9,10,11]
[null,"Complete Years",50,27.995999999999999,27.957999999999998,27.919,27.88,27.841999999999999,27.803000000000001,27.765000000000001,27.725999999999999,27.687999999999999,27.649000000000001,27.611000000000001,27.571999999999999]
[null,null,51,27.533000000000001,27.492999999999999,27.452000000000002,27.411999999999999,27.370999999999999,27.331,27.29,27.25,27.209,27.169,27.128,27.087]
[null,null,52,27.047000000000001,27.004000000000001,26.962,26.919,26.876999999999999,26.834,26.791,26.748999999999999,26.706,26.664000000000001,26.620999999999999,26.577999999999999]
[null,null,53,26.536000000000001,26.491,26.446000000000002,26.402000000000001,26.356999999999999,26.312000000000001,26.266999999999999,26.222999999999999,26.178000000000001,26.132999999999999,26.088000000000001,26.044]
[null,null,54,25.998999999999999,25.952000000000002,25.905000000000001,25.858000000000001,25.811,25.763999999999999,25.716999999999999,25.67,25.623000000000001,25.577000000000002,25.53,25.483000000000001]
[null,null,55,25.436,25.387,25.338999999999999,25.29,25.241,25.193000000000001,25.143999999999998,25.096,25.047000000000001,24.998000000000001,24.95,24.901]
[null,null,56,24.853000000000002,24.803000000000001,24.754000000000001,24.704999999999998,24.655999999999999,24.606999999999999,24.558,24.509,24.46,24.411000000000001,24.361999999999998,24.312999999999999]
[null,null,57,24.263000000000002,24.213999999999999,24.164000000000001,24.114999999999998,24.065000000000001,24.015000000000001,23.966000000000001,23.916,23.867000000000001,23.817,23.766999999999999,23.718]
{"$rows_left_out":35}
{"sheet":"VER Factors (pre 01-09-2023)","index":8,"n_rows":320,"n_cols":27,"rows_kept":320,"cut":false,"hidden":true,"merged":[[212,2,212,14],[277,2,277,14],[89,2,89,15],[90,2,90,15],[91,2,91,15],[92,2,92,15],[94,2,94,14],[153,2,153,14],[84,2,84,14],[24,3,24,14],[25,3,25,14],[40,1,40,14],[41,3,41,14],[42,3,42,14],[67,2,67,14],[81,2,81,14],[82,2,82,14],[83,2,83,14],[27,1,37,1],[44,1,59,1],[23,1,23,14],[1,1,1,14],[3,1,3,14],[4,3,4,14],[5,3,5,14],[7,1,17,1]]}
["Factors in these tables are applicable between 30th June 2023 until 31st August 2023"]
[null,"NHS Pension Scheme (E&W): Early Retirement Factors"]
[]
[null,"Benefits Payable to the Member on ARER\n1995 Scheme (NPA 60)"]
[null,"Table - ERF 1",null,"Pension Factors"]
[null,null,null,"Age: Complete Months"]
[null,null,null,0,1,2,3,4,5,6,7,8,9,10,11]
[null,"Complete Years",50,0.68200000000000005,0.68400000000000005,0.68600000000000005,0.68799999999999994,0.68899999999999995,0.69099999999999995,0.69299999999999995,0.69499999999999995,0.69699999999999995,0.69899999999999995,0.7,0.70199999999999996]
[null,null,51,0.70399999999999996,0.70599999999999996,0.70799999999999996,0.71,0.71199999999999997,0.71399999999999997,0.71599999999999997,0.71799999999999997,0.72,0.72199999999999998,0.72399999999999998,0.72599999999999998]
[null,null,52,0.72799999999999998,0.73,0.73199999999999998,0.73499999999999999,0.73699999999999999,0.73899999999999999,0.74099999999999999,0.74299999999999999,0.745,0.748,0.75,0.752]
[null,null,53,0.754,0.75600000000000001,0.75900000000000001,0.76100000000000001,0.76300000000000001,0.76600000000000001,0.76800000000000002,0.77,0.77300000000000002,0.77500000000000002,0.77700000000000002,0.78]
[null,null,54,0.78200000000000003,0.78500000000000003,0.78700000000000003,0.79,0.79200000000000004,0.79500000000000004,0.79700000000000004,0.8,0.80200000000000005,0.80500000000000005,0.80700000000000005,0.81]
[null,null,55,0.81200000000000006,0.81499999999999995,0.81799999999999995,0.82,0.82299999999999995,0.82599999999999996,0.82899999999999996,0.83099999999999996,0.83399999999999996,0.83699999999999997,0.84,0.84199999999999997]
[null,null,56,0.84499999999999997,0.84799999999999998,0.85099999999999998,0.85399999999999998,0.85699999999999998,0.86,0.86299999999999999,0.86499999999999999,0.86799999999999999,0.871,0.874,0.877]
[null,null,57,0.88,0.88300000000000001,0.88600000000000001,0.88900000000000001,0.89200000000000002,0.89500000000000002,0.89900000000000002,0.90200000000000002,0.90500000000000003,0.90800000000000003,0.91100000000000003,0.91400000000000003]
{"$rows_left_out":306}
{"sheet":"CER Factors (pre 1-11-23)","index":9,"n_rows":49,"n_cols":15,"rows_kept":49,"cut":false,"hidden":true,"merged":[[31,3,31,14],[32,3,32,14],[34,1,44,1],[48,2,48,14],[1,2,1,14],[3,1,3,14],[4,3,4,14],[5,3,5,14],[7,1,25,1],[30,1,30,14]]}
[]
[null,null,"NHS Pension Scheme (E&W): Acutarial Factors"]
[]
[null,"Cost for a Member leaving on Complusory Early Retirement\nFactors Applicable to Main Pension Scheme"]
[null,"Table - CER 1",null,"Pension Factors"]
[null,null,null,"Age: Complete Months"]
[null,null,null,0,1,2,3,4,5,6,7,8,9,10,11]
[null,"Complete Years",50,25.369,25.341000000000001,25.314,25.286000000000001,25.259,25.231000000000002,25.204000000000001,25.175999999999998,25.149000000000001,25.120999999999999,25.094000000000001,25.065999999999999]
[null,null,51,25.039000000000001,25.009,24.98,24.95,24.920999999999999,24.890999999999998,24.861999999999998,24.832999999999998,24.803000000000001,24.774000000000001,24.744,24.715]
[null,null,52,24.684999999999999,24.654,24.622,24.591000000000001,24.559000000000001,24.527999999999999,24.495999999999999,24.465,24.434000000000001,24.402000000000001,24.370999999999999,24.338999999999999]
[null,null,53,24.308,24.274000000000001,24.24,24.207000000000001,24.172999999999998,24.14,24.106000000000002,24.071999999999999,24.039000000000001,24.004999999999999,23.972000000000001,23.937999999999999]
[null,null,54,23.905000000000001,23.869,23.832999999999998,23.797000000000001,23.760999999999999,23.725000000000001,23.69,23.654,23.617999999999999,23.582000000000001,23.545999999999999,23.51]
[null,null,55,23.475000000000001,23.437000000000001,23.399000000000001,23.361999999999998,23.324000000000002,23.286999999999999,23.248999999999999,23.212,23.173999999999999,23.135999999999999,23.099,23.061]
[null,null,56,23.024000000000001,22.986000000000001,22.946999999999999,22.908999999999999,22.870999999999999,22.832999999999998,22.795000000000002,22.757000000000001,22.719000000000001,22.681000000000001,22.641999999999999,22.603999999999999]
[null,null,57,22.565999999999999,22.527000000000001,22.489000000000001,22.45,22.411000000000001,22.373000000000001,22.334,22.295000000000002,22.256,22.218,22.178999999999998,22.14]
{"$rows_left_out":35}
{"sheet":"VER Factors (pre 30-06-2023)","index":10,"n_rows":320,"n_cols":27,"rows_kept":320,"cut":false,"hidden":true,"merged":[[23,1,23,14],[1,1,1,14],[3,1,3,14],[4,3,4,14],[5,3,5,14],[7,1,16,1],[84,2,84,14],[24,3,24,14],[25,3,25,14],[27,1,36,1],[40,1,40,14],[41,3,41,14],[42,3,42,14],[44,1,58,1],[67,2,67,14],[81,2,81,14],[82,2,82,14],[83,2,83,14],[212,2,212,14],[277,2,277,14],[89,2,89,15],[90,2,90,15],[91,2,91,15],[92,2,92,15],[94,2,94,14],[153,2,153,14]]}
["Factors in these tables are applicable prior to 30th June 2023"]
[null,"NHS Pension Scheme (E&W): Early Retirement Factors"]
[]
[null,"Benefits Payable to the Member on ARER\n1995 Scheme (NPA 60)"]
[null,"Table - ERF 1",null,"Pension Factors"]
[null,null,null,"Age: Complete Months"]
[null,null,null,0,1,2,3,4,5,6,7,8,9,10,11]
[null,"Complete Years",50,0.66100000000000003,0.66300000000000003,0.66500000000000004,0.66700000000000004,0.66900000000000004,0.67100000000000004,0.67300000000000004,0.67500000000000004,0.67700000000000005,0.67900000000000005,0.68100000000000005,0.68300000000000005]
[null,null,51,0.68500000000000005,0.68700000000000006,0.68899999999999995,0.69099999999999995,0.69299999999999995,0.69499999999999995,0.69699999999999995,0.7,0.70199999999999996,0.70399999999999996,0.70599999999999996,0.70799999999999996]
[null,null,52,0.71,0.71299999999999997,0.71499999999999997,0.71699999999999997,0.72,0.72199999999999998,0.72399999999999998,0.72599999999999998,0.72899999999999998,0.73099999999999998,0.73299999999999998,0.73599999999999999]
[null,null,53,0.73799999999999999,0.74,0.74299999999999999,0.745,0.748,0.75,0.753,0.755,0.75800000000000001,0.76,0.76300000000000001,0.76500000000000001]
[null,null,54,0.76800000000000002,0.77100000000000002,0.77300000000000002,0.77600000000000002,0.77900000000000003,0.78100000000000003,0.78400000000000003,0.78700000000000003,0.78900000000000003,0.79200000000000004,0.79500000000000004,0.79800000000000004]
[null,null,55,0.8,0.80300000000000005,0.80600000000000005,0.80900000000000005,0.81200000000000006,0.81499999999999995,0.81799999999999995,0.82099999999999995,0.82399999999999995,0.82599999999999996,0.82899999999999996,0.83199999999999996]
[null,null,56,0.83499999999999996,0.83799999999999997,0.84099999999999997,0.84399999999999997,0.84799999999999998,0.85099999999999998,0.85399999999999998,0.85699999999999998,0.86,0.86299999999999999,0.86599999999999999,0.86899999999999999]
[null,null,57,0.872,0.876,0.879,0.88200000000000001,0.88600000000000001,0.88900000000000001,0.89200000000000002,0.89600000000000002,0.89900000000000002,0.90200000000000002,0.90500000000000003,0.90900000000000003]
{"$rows_left_out":305}